Reaction Details
TargetDual specificity protein kinase CLK4
LigandBDBM50154343
Substrate/Competitorn/a
Meas. Tech.ChEMBL_1560211 (CHEMBL3778450)
IC50 32±n/a nM
Citation Mariano, MHartmann, RWEngel, M Systematic diversification of benzylidene heterocycles yields novel inhibitor scaffolds selective for Dyrk1A, Clk1 and CK2. Eur J Med Chem112:209-16 (2016) 
 
Dual specificity protein kinase CLK4
Name:Dual specificity protein kinase CLK4
Type:Serine/threonine-protein kinase
Mol. Mass.:57522.53
Organism:Homo sapiens (Human)
Description:gi_10190706
Residue:481
BDBM50154343
NameBDBM50154343
Synonyms:CHEMBL3775393
TypeSmall organic molecule
Emp. Form.C11H6N2OS3
Mol. Mass.278.373
SMILESO=C1NC(=S)S\C1=C/c1ccc2ncsc2c1