Reaction Details
TargetMyosin light chain kinase 2, skeletal/cardiac muscle
LigandBDBM50154342
Substrate/Competitorn/a
Meas. Tech.ChEMBL_1560466 (CHEMBL3776317)
IC50 157±n/a nM
Citation Mariano, MHartmann, RWEngel, M Systematic diversification of benzylidene heterocycles yields novel inhibitor scaffolds selective for Dyrk1A, Clk1 and CK2. Eur J Med Chem112:209-16 (2016) 
 
Myosin light chain kinase 2, skeletal/cardiac muscle
Name:Myosin light chain kinase 2, skeletal/cardiac muscle
Type:PROTEIN
Mol. Mass.:64687.13
Organism:Homo sapiens (Human)
Description:ChEMBL_586581
Residue:596
BDBM50154342
NameBDBM50154342
Synonyms:CHEMBL3774448
TypeSmall organic molecule
Emp. Form.C13H8N2OS2
Mol. Mass.272.345
SMILESO=C1NC(=S)S\C1=C/c1ccc2ncccc2c1