Reaction Details
TargetSomatostatin receptor type 3
LigandBDBM50400517
Substrate/Competitorn/a
Meas. Tech.ChEMBL_1560971 (CHEMBL3779604)
EC50 0.950000±n/a nM
Citation He, SDobbelaar, PHGuo, LYe, ZLiu, JJian, TTruong, QShah, SKDu, WQi, HBakshi, RKHong, QDellureficio, JDSherer, EPasternak, AFeng, ZReibarkh, MLin, MSamuel, KReddy, VBMitelman, STong, SXChicchi, GGTsao, KLTrusca, DWu, MShao, QTrujillo, MEFernandez, GNelson, DBunting, PKerr, JFitzgerald, PMorissette, PVolksdorf, SEiermann, GJLi, CZhang, BBHoward, ADZhou, YPNargund, RPHagmann, WK SAR exploration at the C-3 position of tetrahydro-ß-carboline sstr3 antagonists. Bioorg Med Chem Lett26:1529-35 (2016) 
 
Somatostatin receptor type 3
Name:Somatostatin receptor type 3
Type:Protein
Mol. Mass.:45855.97
Organism:Homo sapiens (Human)
Description:P32745
Residue:418
BDBM50400517
NameBDBM50400517
Synonyms:CHEMBL2204935
TypeSmall organic molecule
Emp. Form.C27H23FN8O
Mol. Mass.494.5229
SMILESCc1nc(no1)[C@@]1(N[C@H](Cc2c1[nH]c1ccccc21)c1nc(c[nH]1)-c1ccc(F)cc1)c1cnn(C)c1