Reaction Details
TargetLiver carboxylesterase 1
LigandBDBM50188385
Substrate/Competitorn/a
Meas. Tech.ChEMBL_1561177 (CHEMBL3777370)
IC50 49860±n/a nM
Citation Zou, LWLi, YGWang, PZhou, KHou, JJin, QHao, DCGe, GBYang, L Design, synthesis, and structure-activity relationship study of glycyrrhetinic acid derivatives as potent and selective inhibitors against human carboxylesterase 2. Eur J Med Chem112:280-8 (2016) 
 
Liver carboxylesterase 1
Name:Liver carboxylesterase 1
Type:Protein
Mol. Mass.:62520.83
Organism:Homo sapiens (Human)
Description:n/a
Residue:567
BDBM50188385
NameBDBM50188385
Synonyms:(2S,4aS,6aS,6bR,8aR,10S,12aS,12bR,14bR)-10-acetoxy-2,4a,6a,6b,9,9,12a-heptamethyl-13-oxo-1,2,3,4,4a,5,6,6a,6b,7,8,8a,9,10,11,12,12a,12b,13,14b-icosahydropicene-2-carboxylic acid CHEMBL207413
TypeSmall organic molecule
Emp. Form.C32H48O5
Mol. Mass.512.7205
SMILESCC(=O)O[C@H]1CC[C@@]2(C)[C@@H](CC[C@]3(C)[C@@H]2C(=O)C=C2[C@@H]4C[C@](C)(CC[C@]4(C)CC[C@@]32C)C(O)=O)C1(C)C