Reaction Details
TargetCocaine esterase
LigandBDBM50154559
Substrate/Competitorn/a
Meas. Tech.ChEMBL_1561176 (CHEMBL3777369)
IC50 660±n/a nM
Citation Zou, LWLi, YGWang, PZhou, KHou, JJin, QHao, DCGe, GBYang, L Design, synthesis, and structure-activity relationship study of glycyrrhetinic acid derivatives as potent and selective inhibitors against human carboxylesterase 2. Eur J Med Chem112:280-8 (2016) 
 
Cocaine esterase
Name:Cocaine esterase
Type:PROTEIN
Mol. Mass.:61801.08
Organism:Homo sapiens (Human)
Description:ChEMBL_1494240
Residue:559
BDBM50154559
NameBDBM50154559
Synonyms:CHEMBL2151605
TypeSmall organic molecule
Emp. Form.C36H54O7
Mol. Mass.598.8098
SMILES[H][C@@]12C[C@](C)(CC[C@]1(C)CC[C@]1(C)C2=CC(=O)[C@]2([H])[C@@]3(C)CC[C@H](OC(=O)CCC(O)=O)C(C)(C)[C@]3([H])CC[C@@]12C)C(=O)OCC