Reaction Details
TargetCocaine esterase
LigandBDBM50154554
Substrate/Competitorn/a
Meas. Tech.ChEMBL_1561176 (CHEMBL3777369)
IC50 3950±n/a nM
Citation Zou, LWLi, YGWang, PZhou, KHou, JJin, QHao, DCGe, GBYang, L Design, synthesis, and structure-activity relationship study of glycyrrhetinic acid derivatives as potent and selective inhibitors against human carboxylesterase 2. Eur J Med Chem112:280-8 (2016) 
 
Cocaine esterase
Name:Cocaine esterase
Type:PROTEIN
Mol. Mass.:61801.08
Organism:Homo sapiens (Human)
Description:ChEMBL_1494240
Residue:559
BDBM50154554
NameBDBM50154554
Synonyms:CHEMBL3775391
TypeSmall organic molecule
Emp. Form.C34H55NO4
Mol. Mass.541.8048
SMILES[H][C@@]12C[C@](C)(CC[C@]1(C)CC[C@]1(C)C2=CC(=O)[C@]2([H])[C@@]3(C)CC[C@H](O)C(C)(C)[C@]3([H])CC[C@@]12C)C(=O)OCCN(C)C