Reaction Details
TargetCocaine esterase
LigandBDBM50346605
Substrate/Competitorn/a
Meas. Tech.ChEMBL_1561176 (CHEMBL3777369)
IC50 6950±n/a nM
Citation Zou, LWLi, YGWang, PZhou, KHou, JJin, QHao, DCGe, GBYang, L Design, synthesis, and structure-activity relationship study of glycyrrhetinic acid derivatives as potent and selective inhibitors against human carboxylesterase 2. Eur J Med Chem112:280-8 (2016) 
 
Cocaine esterase
Name:Cocaine esterase
Type:PROTEIN
Mol. Mass.:61801.08
Organism:Homo sapiens (Human)
Description:ChEMBL_1494240
Residue:559
BDBM50346605
NameBDBM50346605
Synonyms:CHEMBL487933
TypeSmall organic molecule
Emp. Form.C30H48O3
Mol. Mass.456.7003
SMILESCC1(C)[C@@H](O)CC[C@@]2(C)[C@H]1CC[C@]1(C)[C@@H]2CC=C2[C@@H]3C[C@](C)(CC[C@]3(C)CC[C@@]12C)C(O)=O