Reaction Details
TargetVascular endothelial growth factor receptor 2
LigandBDBM50154813
Substrate/Competitorn/a
Meas. Tech.ChEMBL_1561421 (CHEMBL3779157)
IC50 86±n/a nM
Citation Tang, QWang, LTu, YZhu, WLuo, RTu, QWang, PWu, CGong, PZheng, P Discovery of novel pyrrolo[2,3-b]pyridine derivatives bearing 1,2,3-triazole moiety as c-Met kinase inhibitors. Bioorg Med Chem Lett26:1680-4 (2016) 
 
Vascular endothelial growth factor receptor 2
Name:Vascular endothelial growth factor receptor 2
Type:Receptor Tyrosine Kinase
Mol. Mass.:151510.97
Organism:Homo sapiens (Human)
Description:P35968
Residue:1356
BDBM50154813
NameBDBM50154813
Synonyms:CHEMBL3774451
TypeSmall organic molecule
Emp. Form.C23H13F5N6O2
Mol. Mass.500.3803
SMILESFc1ccc(cc1)-n1nnc(C(=O)Nc2ccc(Oc3ccnc4[nH]ccc34)c(F)c2)c1C(F)(F)F