Reaction Details
TargetMast/stem cell growth factor receptor Kit
LigandBDBM50154813
Substrate/Competitorn/a
Meas. Tech.ChEMBL_1561422 (CHEMBL3779158)
IC50 325±n/a nM
Citation Tang, QWang, LTu, YZhu, WLuo, RTu, QWang, PWu, CGong, PZheng, P Discovery of novel pyrrolo[2,3-b]pyridine derivatives bearing 1,2,3-triazole moiety as c-Met kinase inhibitors. Bioorg Med Chem Lett26:1680-4 (2016) 
 
Mast/stem cell growth factor receptor Kit
Name:Mast/stem cell growth factor receptor Kit
Type:Protein
Mol. Mass.:109869.37
Organism:Homo sapiens (Human)
Description:P10721
Residue:976
BDBM50154813
NameBDBM50154813
Synonyms:CHEMBL3774451
TypeSmall organic molecule
Emp. Form.C23H13F5N6O2
Mol. Mass.500.3803
SMILESFc1ccc(cc1)-n1nnc(C(=O)Nc2ccc(Oc3ccnc4[nH]ccc34)c(F)c2)c1C(F)(F)F