Reaction Details
TargetEpidermal growth factor receptor
LigandBDBM50154813
Substrate/Competitorn/a
Meas. Tech.ChEMBL_1561423 (CHEMBL3779159)
IC50 582±n/a nM
Citation Tang, QWang, LTu, YZhu, WLuo, RTu, QWang, PWu, CGong, PZheng, P Discovery of novel pyrrolo[2,3-b]pyridine derivatives bearing 1,2,3-triazole moiety as c-Met kinase inhibitors. Bioorg Med Chem Lett26:1680-4 (2016) 
 
Epidermal growth factor receptor
Name:Epidermal growth factor receptor
Type:Receptor Kinase Domain
Mol. Mass.:134279.59
Organism:Homo sapiens (Human)
Description:P00533
Residue:1210
BDBM50154813
NameBDBM50154813
Synonyms:CHEMBL3774451
TypeSmall organic molecule
Emp. Form.C23H13F5N6O2
Mol. Mass.500.3803
SMILESFc1ccc(cc1)-n1nnc(C(=O)Nc2ccc(Oc3ccnc4[nH]ccc34)c(F)c2)c1C(F)(F)F