Reaction Details
TargetHepatocyte growth factor receptor
LigandBDBM50154825
Substrate/Competitorn/a
Meas. Tech.ChEMBL_1561414 (CHEMBL3778974)
IC50 43±n/a nM
Citation Tang, QWang, LTu, YZhu, WLuo, RTu, QWang, PWu, CGong, PZheng, P Discovery of novel pyrrolo[2,3-b]pyridine derivatives bearing 1,2,3-triazole moiety as c-Met kinase inhibitors. Bioorg Med Chem Lett26:1680-4 (2016) 
 
Hepatocyte growth factor receptor
Name:Hepatocyte growth factor receptor
Type:Protein
Mol. Mass.:155559.73
Organism:Homo sapiens (Human)
Description:P08581
Residue:1390
BDBM50154825
NameBDBM50154825
Synonyms:CHEMBL3775785
TypeSmall organic molecule
Emp. Form.C24H16ClF3N6O2
Mol. Mass.512.871
SMILESCc1c(nnn1-c1ccc(Cl)c(c1)C(F)(F)F)C(=O)Nc1ccc(Oc2ccnc3[nH]ccc23)cc1