Reaction Details
TargetHepatocyte growth factor receptor
LigandBDBM50154828
Substrate/Competitorn/a
Meas. Tech.ChEMBL_1561414 (CHEMBL3778974)
IC50 25±n/a nM
Citation Tang, QWang, LTu, YZhu, WLuo, RTu, QWang, PWu, CGong, PZheng, P Discovery of novel pyrrolo[2,3-b]pyridine derivatives bearing 1,2,3-triazole moiety as c-Met kinase inhibitors. Bioorg Med Chem Lett26:1680-4 (2016) 
 
Hepatocyte growth factor receptor
Name:Hepatocyte growth factor receptor
Type:Protein
Mol. Mass.:155559.73
Organism:Homo sapiens (Human)
Description:P08581
Residue:1390
BDBM50154828
NameBDBM50154828
Synonyms:CHEMBL3775275
TypeSmall organic molecule
Emp. Form.C24H20N6O3
Mol. Mass.440.454
SMILESCOc1ccc(cc1)-n1nnc(C(=O)Nc2ccc(Oc3ccnc4[nH]ccc34)cc2)c1C