Reaction Details
TargetHepatocyte growth factor receptor
LigandBDBM50399540
Substrate/Competitorn/a
Meas. Tech.ChEMBL_1561414 (CHEMBL3778974)
IC50 1.9±n/a nM
Citation Tang, QWang, LTu, YZhu, WLuo, RTu, QWang, PWu, CGong, PZheng, P Discovery of novel pyrrolo[2,3-b]pyridine derivatives bearing 1,2,3-triazole moiety as c-Met kinase inhibitors. Bioorg Med Chem Lett26:1680-4 (2016) 
 
Hepatocyte growth factor receptor
Name:Hepatocyte growth factor receptor
Type:Protein
Mol. Mass.:155559.73
Organism:Homo sapiens (Human)
Description:P08581
Residue:1390
BDBM50399540
NameBDBM50399540
Synonyms:FORETINIB US10882853, Compound For-Oxide
TypeSmall organic molecule
Emp. Form.C34H34F2N4O6
Mol. Mass.632.6538
SMILESCOc1cc2c(Oc3ccc(NC(=O)C4(CC4)C(=O)Nc4ccc(F)cc4)cc3F)ccnc2cc1OCCCN1CCOCC1