Reaction Details
TargetD(3) dopamine receptor
LigandBDBM50154895
Substrate/Competitorn/a
Meas. Tech.ChEMBL_1561630 (CHEMBL3776607)
Ki 6.31±n/a nM
Citation Micheli, FBernardelli, ABianchi, FBraggio, SCastelletti, LCavallini, PCavanni, PCremonesi, SDal Cin, MFeriani, AOliosi, BSemeraro, TTarsi, LTomelleri, SWong, AVisentini, FZonzini, LHeidbreder, C 1,2,4-Triazolyl octahydropyrrolo[2,3-b]pyrroles: A new series of potent and selective dopamine D3 receptor antagonists. Bioorg Med Chem24:1619-36 (2016) 
 
D(3) dopamine receptor
Name:D(3) dopamine receptor
Type:n/a
Mol. Mass.:44243.43
Organism:Homo sapiens (Human)
Description:n/a
Residue:400
BDBM50154895
NameBDBM50154895
Synonyms:CHEMBL3775534 US10584135, Example 7
TypeSmall organic molecule
Emp. Form.C23H27N7OS
Mol. Mass.449.572
SMILESCc1ncoc1-c1nnc(SCCCN2CC3CCN(C3C2)c2cccc(c2)C#N)n1C