Reaction Details
TargetD(3) dopamine receptor
LigandBDBM50154896
Substrate/Competitorn/a
Meas. Tech.ChEMBL_1561630 (CHEMBL3776607)
Ki 0.794328±n/a nM
Citation Micheli, FBernardelli, ABianchi, FBraggio, SCastelletti, LCavallini, PCavanni, PCremonesi, SDal Cin, MFeriani, AOliosi, BSemeraro, TTarsi, LTomelleri, SWong, AVisentini, FZonzini, LHeidbreder, C 1,2,4-Triazolyl octahydropyrrolo[2,3-b]pyrroles: A new series of potent and selective dopamine D3 receptor antagonists. Bioorg Med Chem24:1619-36 (2016) 
 
D(3) dopamine receptor
Name:D(3) dopamine receptor
Type:n/a
Mol. Mass.:44243.43
Organism:Homo sapiens (Human)
Description:n/a
Residue:400
BDBM50154896
NameBDBM50154896
Synonyms:CHEMBL3774462 US10584135, Example 51
TypeSmall organic molecule
Emp. Form.C24H32F3N5S
Mol. Mass.479.605
SMILESCn1c(SCCCN2CC3CCN(C3C2)c2ccc(cc2)C(F)(F)F)nnc1C1CCCC1