Reaction Details
TargetTubulin beta chain
LigandBDBM50154909
Substrate/Competitorn/a
Meas. Tech.ChEMBL_1562114 (CHEMBL3779656)
IC50 1230±n/a nM
Citation Kumar, GBNayak, VLSayeed, IBReddy, VSShaik, ABMahesh, RBaig, MFShareef, MARavikumar, AKamal, A Design, synthesis of phenstatin/isocombretastatin-oxindole conjugates as antimitotic agents. Bioorg Med Chem24:1729-40 (2016) 
 
Tubulin beta chain
Name:Tubulin beta chain
Type:PROTEIN
Mol. Mass.:49840.26
Organism:Sus scrofa
Description:ChEMBL_105107
Residue:445
BDBM50154909
NameBDBM50154909
Synonyms:CHEMBL3775082
TypeSmall organic molecule
Emp. Form.C27H25NO7
Mol. Mass.475.4899
SMILESCOc1ccc2NC(=O)\C(=C\c3cc(ccc3OC)C(=O)c3cc(OC)c(OC)c(OC)c3)c2c1