Reaction Details
TargetCyclin-dependent kinase 9
LigandBDBM50347389
Substrate/Competitorn/a
Meas. Tech.ChEMBL_1561754 (CHEMBL3777660)
IC50 2180±n/a nM
Citation Vymetalová, LHavlícek, L?turc, ASkrá?ková, ZJorda, RPospí?il, TStrnad, MKry?tof, V 5-Substituted 3-isopropyl-7-[4-(2-pyridyl)benzyl]amino-1(2)H-pyrazolo[4,3-d]pyrimidines with anti-proliferative activity as potent and selective inhibitors of cyclin-dependent kinases. Eur J Med Chem110:291-301 (2016) 
 
Cyclin-dependent kinase 9
Name:Cyclin-dependent kinase 9
Type:Enzyme Subunit
Mol. Mass.:42789.13
Organism:Homo sapiens (Human)
Description:n/a
Residue:372
BDBM50347389
NameBDBM50347389
Synonyms:CHEMBL1801932
TypeSmall organic molecule
Emp. Form.C22H32N6
Mol. Mass.380.5297
SMILESCC(C)c1cnn2c(NCc3ccccc3)cc(NCCCCCCN)nc12