Reaction Details
TargetCyclin-dependent kinase 8
LigandBDBM50155239
Substrate/Competitorn/a
Meas. Tech.ChEMBL_1562015 (CHEMBL3779189)
IC50 5.0±n/a nM
Citation Schiemann, KMallinger, AWienke, DEsdar, CPoeschke, OBusch, MRohdich, FEccles, SASchneider, RRaynaud, FICzodrowski, PMusil, DSchwarz, DUrbahns, KBlagg, J Discovery of potent and selective CDK8 inhibitors from an HSP90 pharmacophore. Bioorg Med Chem Lett26:1443-51 (2016) 
 
Cyclin-dependent kinase 8
Name:Cyclin-dependent kinase 8
Type:Serine/threonine-protein kinase
Mol. Mass.:53300.21
Organism:Homo sapiens (Human)
Description:P49336
Residue:464
BDBM50155239
NameBDBM50155239
Synonyms:CHEMBL3775935
TypeSmall organic molecule
Emp. Form.C23H23N5O
Mol. Mass.385.4616
SMILESCn1cc(cn1)-c1ccc(Cc2n[nH]c3ccc(cc23)C(=O)N2CCCC2)cc1