Reaction Details
TargetType-1 angiotensin II receptor
LigandBDBM50009338
Substrate/Competitorn/a
Meas. Tech.ChEMBL_1559750 (CHEMBL3779530)
IC50 0.400±n/a nM
Citation Waszkielewicz, AMGunia-Krzyzak, APowroznik, BSloczynska, KPekala, EWalczak, MBednarski, MZeslawska, ENitek, WMarona, H Design, physico-chemical properties and biological evaluation of some new N-[(phenoxy)alkyl]- and N-{2-[2-(phenoxy)ethoxy]ethyl}aminoalkanols as anticonvulsant agents. Bioorg Med Chem24:1793-810 (2016) 
 
Type-1 angiotensin II receptor
Name:Type-1 angiotensin II receptor
Type:Protein
Mol. Mass.:41080.75
Organism:Homo sapiens (Human)
Description:P30556
Residue:359
BDBM50009338
NameBDBM50009338
Synonyms:(S)-2-((S)-1-((S)-2-((S)-2-((S)-2-((S)-2-((S)-5-(diaminomethyleneamino)-2-(2-(methylamino)acetamido)pentanamido)-3-methylbutanamido)-3-(4-hydroxyphenyl)propanamido)-3-methylbutanamido)-3-(1H-imidazol-5-yl)propanoyl)pyrrolidine-5-carboxamido)propanoic acid SARALASIN Sar-Arg-Val-Tyr-Val-His-Pro-Ala (sarlasin) | [Sar1-Arg2-Val3-Tyr4-Val5-His6-Pro7-Ala8]
TypeSmall organic molecule
Emp. Form.C42H65N13O10
Mol. Mass.912.0466
SMILESCNCC(=O)N[C@@H](CCCN=C(N)N)C(=O)N[C@@H](C(C)C)C(=O)N[C@@H](Cc1ccc(O)cc1)C(=O)N[C@@H](C(C)C)C(=O)N[C@@H](Cc1cnc[nH]1)C(=O)N1CCC[C@H]1C(=O)N[C@@H](C)C(O)=O