Reaction Details
TargetTyrosine-protein phosphatase non-receptor type 1
LigandBDBM50155759
Substrate/Competitorn/a
Meas. Tech.ChEMBL_1565351 (CHEMBL3782745)
IC50 6300±n/a nM
Citation Khan, MFAzad, CSKumar, ASaini, MNarula, AKJain, S Novel Imbricatolic acid derivatives as protein tyrosine phosphatase-1B inhibitors: Design, synthesis, biological evaluation and molecular docking. Bioorg Med Chem Lett26:1988-92 (2016) 
 
Tyrosine-protein phosphatase non-receptor type 1
Name:Tyrosine-protein phosphatase non-receptor type 1
Type:Protein phosphatase
Mol. Mass.:49963.76
Organism:Homo sapiens (Human)
Description:Human recombinant GST-fusion PTP1B (1-435).
Residue:435
BDBM50155759
NameBDBM50155759
Synonyms:CHEMBL3781453
TypeSmall organic molecule
Emp. Form.C20H36N2O2
Mol. Mass.336.512
SMILES[H][C@@]12CCC(=C)[C@H](CC[C@H](C)CCO)[C@@]1(C)CCC[C@]2(C)NC(N)=O