Reaction Details
TargetSomatostatin receptor type 2
LigandBDBM50155306
Substrate/Competitorn/a
Meas. Tech.ChEMBL_1565563 (CHEMBL3782232)
Ki 4690±n/a nM
Citation Fridén-Saxin, MSeifert, TMalo, Mda Silva Andersson, KPemberton, NDyrager, CFriberg, ADahlén, KWallén, EAGrøtli, MLuthman, K Chroman-4-one and chromone based somatostatinß-turn mimetics. Eur J Med Chem114:59-64 (2016) 
 
Somatostatin receptor type 2
Name:Somatostatin receptor type 2
Type:Enzyme
Mol. Mass.:41344.94
Organism:Homo sapiens (Human)
Description:P30874
Residue:369
BDBM50155306
NameBDBM50155306
Synonyms:CHEMBL3781875
TypeSmall organic molecule
Emp. Form.C21H26N2O2
Mol. Mass.338.4433
SMILESNCCCCCOc1ccccc1OCCc1c[nH]c2ccccc12