Reaction Details
TargetSomatostatin receptor type 2
LigandBDBM50051567
Substrate/Competitorn/a
Meas. Tech.ChEMBL_1565561 (CHEMBL3782230)
Ki 4520±n/a nM
Citation Fridén-Saxin, MSeifert, TMalo, Mda Silva Andersson, KPemberton, NDyrager, CFriberg, ADahlén, KWallén, EAGrøtli, MLuthman, K Chroman-4-one and chromone based somatostatinß-turn mimetics. Eur J Med Chem114:59-64 (2016) 
 
Somatostatin receptor type 2
Name:Somatostatin receptor type 2
Type:Enzyme
Mol. Mass.:41344.94
Organism:Homo sapiens (Human)
Description:P30874
Residue:369
BDBM50051567
NameBDBM50051567
Synonyms:5-{(2R,3R,4S,5R,6R)-3,4,5-Tris-benzyloxy-6-[2-(1H-indol-3-yl)-ethoxy]-tetrahydro-pyran-2-ylmethoxy}-pentylamine CHEMBL282618
TypeSmall organic molecule
Emp. Form.C42H50N2O6
Mol. Mass.678.8562
SMILESNCCCCCOC[C@H]1O[C@@H](OCCc2c[nH]c3ccccc23)[C@H](OCc2ccccc2)[C@@H](OCc2ccccc2)[C@@H]1OCc1ccccc1