Reaction Details
TargetHistone lysine demethylase PHF8
LigandBDBM50155450
Substrate/Competitorn/a
Meas. Tech.ChEBML_1565735
IC50<250±n/a nM
Citation Abdel-Magid, AF Inhibition of Histone Demethylases Offers a Novel and Promising Approach for the Treatment of Cancer and Other Diseases. ACS Med Chem Lett7:128-30 (2016) 
 
Histone lysine demethylase PHF8
Name:Histone lysine demethylase PHF8
Type:Protein
Mol. Mass.:117889.91
Organism:Homo sapiens (Human)
Description:Q9UPP1
Residue:1060
BDBM50155450
NameBDBM50155450
Synonyms:CHEMBL3779953
TypeSmall organic molecule
Emp. Form.C15H18N4O2
Mol. Mass.286.329
SMILESCc1cn2CCN(Cc3cc(ccn3)C(O)=O)CCc2n1