Reaction Details
TargetHistone lysine demethylase PHF8
LigandBDBM50155505
Substrate/Competitorn/a
Meas. Tech.ChEBML_1565735
IC50<250±n/a nM
Citation Abdel-Magid, AF Inhibition of Histone Demethylases Offers a Novel and Promising Approach for the Treatment of Cancer and Other Diseases. ACS Med Chem Lett7:128-30 (2016) 
 
Histone lysine demethylase PHF8
Name:Histone lysine demethylase PHF8
Type:Protein
Mol. Mass.:117889.91
Organism:Homo sapiens (Human)
Description:Q9UPP1
Residue:1060
BDBM50155505
NameBDBM50155505
Synonyms:CHEMBL3781414
TypeSmall organic molecule
Emp. Form.C14H19N3O3
Mol. Mass.277.319
SMILESCCN1CCC(CNCc2cc(ccn2)C(O)=O)C1=O