Reaction Details
TargetLysine-specific demethylase 4C
LigandBDBM50155509
Substrate/Competitorn/a
Meas. Tech.ChEBML_1565733
IC50<250±n/a nM
Citation Abdel-Magid, AF Inhibition of Histone Demethylases Offers a Novel and Promising Approach for the Treatment of Cancer and Other Diseases. ACS Med Chem Lett7:128-30 (2016) 
 
Lysine-specific demethylase 4C
Name:Lysine-specific demethylase 4C
Type:Protein
Mol. Mass.:119979.01
Organism:Homo sapiens (Human)
Description:Q9H3R0
Residue:1056
BDBM50155509
NameBDBM50155509
Synonyms:CHEMBL3780689
TypeSmall organic molecule
Emp. Form.C21H25N3O3
Mol. Mass.367.4415
SMILESC[C@@H](N1CCC[C@H](CNCc2cc(ccn2)C(O)=O)C1=O)c1ccccc1