Reaction Details
TargetLysine-specific demethylase 5B
LigandBDBM50155508
Substrate/Competitorn/a
Meas. Tech.ChEMBL_1565737 (CHEMBL3782535)
IC50<250±n/a nM
Citation Abdel-Magid, AF Inhibition of Histone Demethylases Offers a Novel and Promising Approach for the Treatment of Cancer and Other Diseases. ACS Med Chem Lett7:128-30 (2016) 
 
Lysine-specific demethylase 5B
Name:Lysine-specific demethylase 5B
Type:Protein
Mol. Mass.:175659.67
Organism:Homo sapiens (Human)
Description:Q9UGL1
Residue:1544
BDBM50155508
NameBDBM50155508
Synonyms:CHEMBL3780833
TypeSmall organic molecule
Emp. Form.C21H25N3O3
Mol. Mass.367.4415
SMILESC[C@@H](N1CCC[C@@H](CNCc2cc(ccn2)C(O)=O)C1=O)c1ccccc1