Reaction Details
TargetLysine-specific demethylase 5B
LigandBDBM50155450
Substrate/Competitorn/a
Meas. Tech.ChEMBL_1565737 (CHEMBL3782535)
IC50<250±n/a nM
Citation Abdel-Magid, AF Inhibition of Histone Demethylases Offers a Novel and Promising Approach for the Treatment of Cancer and Other Diseases. ACS Med Chem Lett7:128-30 (2016) 
 
Lysine-specific demethylase 5B
Name:Lysine-specific demethylase 5B
Type:Protein
Mol. Mass.:175659.67
Organism:Homo sapiens (Human)
Description:Q9UGL1
Residue:1544
BDBM50155450
NameBDBM50155450
Synonyms:CHEMBL3779953
TypeSmall organic molecule
Emp. Form.C15H18N4O2
Mol. Mass.286.329
SMILESCc1cn2CCN(Cc3cc(ccn3)C(O)=O)CCc2n1