Reaction Details
TargetREST corepressor 1 [4-485]
LigandBDBM50155581
Substrate/Competitorn/a
Meas. Tech.ChEMBL_1564915 (CHEMBL3782872)
IC50 230±n/a nM
Citation Vianello, PBotrugno, OACappa, ADal Zuffo, RDessanti, PMai, AMarrocco, BMattevi, AMeroni, GMinucci, SStazi, GThaler, FTrifiró, PValente, SVilla, MVarasi, MMercurio, C Discovery of a Novel Inhibitor of Histone Lysine-Specific Demethylase 1A (KDM1A/LSD1) as Orally Active Antitumor Agent. J Med Chem59:1501-17 (2016) 
 
REST corepressor 1 [4-485]
Name:REST corepressor 1 [4-485]
Type:PROTEIN
Mol. Mass.:53029.95
Organism:Homo sapiens (Human)
Description:ChEMBL_108118
Residue:482
BDBM50155581
NameBDBM50155581
Synonyms:CHEMBL3781124
TypeSmall organic molecule
Emp. Form.C21H28Cl2N4O
Mol. Mass.423.379
SMILESCl.Cl.CN1CCN(CC1)c1ccc(cc1)C(=O)Nc1ccc(cc1)[C@H]1C[C@@H]1N