Reaction Details
TargetAmine oxidase [flavin-containing] A
LigandBDBM50155581
Substrate/Competitorn/a
Meas. Tech.ChEMBL_1564916 (CHEMBL3782873)
IC50 160±n/a nM
Citation Vianello, PBotrugno, OACappa, ADal Zuffo, RDessanti, PMai, AMarrocco, BMattevi, AMeroni, GMinucci, SStazi, GThaler, FTrifiró, PValente, SVilla, MVarasi, MMercurio, C Discovery of a Novel Inhibitor of Histone Lysine-Specific Demethylase 1A (KDM1A/LSD1) as Orally Active Antitumor Agent. J Med Chem59:1501-17 (2016) 
 
Amine oxidase [flavin-containing] A
Name:Amine oxidase [flavin-containing] A
Type:Protein
Mol. Mass.:59689.53
Organism:Homo sapiens (Human)
Description:P21397
Residue:527
BDBM50155581
NameBDBM50155581
Synonyms:CHEMBL3781124
TypeSmall organic molecule
Emp. Form.C21H28Cl2N4O
Mol. Mass.423.379
SMILESCl.Cl.CN1CCN(CC1)c1ccc(cc1)C(=O)Nc1ccc(cc1)[C@H]1C[C@@H]1N