Reaction Details
TargetAmine oxidase [flavin-containing] A
LigandBDBM50155764
Substrate/Competitorn/a
Meas. Tech.ChEMBL_1564916 (CHEMBL3782873)
IC50 25±n/a nM
Citation Vianello, PBotrugno, OACappa, ADal Zuffo, RDessanti, PMai, AMarrocco, BMattevi, AMeroni, GMinucci, SStazi, GThaler, FTrifiró, PValente, SVilla, MVarasi, MMercurio, C Discovery of a Novel Inhibitor of Histone Lysine-Specific Demethylase 1A (KDM1A/LSD1) as Orally Active Antitumor Agent. J Med Chem59:1501-17 (2016) 
 
Amine oxidase [flavin-containing] A
Name:Amine oxidase [flavin-containing] A
Type:Protein
Mol. Mass.:59689.53
Organism:Homo sapiens (Human)
Description:P21397
Residue:527
BDBM50155764
NameBDBM50155764
Synonyms:CHEMBL3780674
TypeSmall organic molecule
Emp. Form.C24H24ClN3O3
Mol. Mass.437.919
SMILESCl.N[C@@H]1C[C@H]1c1ccc(NC(=O)c2cccc(NC(=O)OCc3ccccc3)c2)cc1