Reaction Details
TargetLysine-specific histone demethylase 2
LigandBDBM50155581
Substrate/Competitorn/a
Meas. Tech.ChEMBL_1564918 (CHEMBL3782875)
IC50 44000±n/a nM
Citation Vianello, PBotrugno, OACappa, ADal Zuffo, RDessanti, PMai, AMarrocco, BMattevi, AMeroni, GMinucci, SStazi, GThaler, FTrifiró, PValente, SVilla, MVarasi, MMercurio, C Discovery of a Novel Inhibitor of Histone Lysine-Specific Demethylase 1A (KDM1A/LSD1) as Orally Active Antitumor Agent. J Med Chem59:1501-17 (2016) 
 
Lysine-specific histone demethylase 2
Name:Lysine-specific histone demethylase 2
Type:PROTEIN
Mol. Mass.:92112.91
Organism:Homo sapiens (Human)
Description:ChEMBL_992590
Residue:822
BDBM50155581
NameBDBM50155581
Synonyms:CHEMBL3781124
TypeSmall organic molecule
Emp. Form.C21H28Cl2N4O
Mol. Mass.423.379
SMILESCl.Cl.CN1CCN(CC1)c1ccc(cc1)C(=O)Nc1ccc(cc1)[C@H]1C[C@@H]1N