Reaction Details
TargetLysine-specific histone demethylase 2
LigandBDBM50155766
Substrate/Competitorn/a
Meas. Tech.ChEMBL_1564918 (CHEMBL3782875)
IC50 12600±n/a nM
Citation Vianello, PBotrugno, OACappa, ADal Zuffo, RDessanti, PMai, AMarrocco, BMattevi, AMeroni, GMinucci, SStazi, GThaler, FTrifiró, PValente, SVilla, MVarasi, MMercurio, C Discovery of a Novel Inhibitor of Histone Lysine-Specific Demethylase 1A (KDM1A/LSD1) as Orally Active Antitumor Agent. J Med Chem59:1501-17 (2016) 
 
Lysine-specific histone demethylase 2
Name:Lysine-specific histone demethylase 2
Type:PROTEIN
Mol. Mass.:92112.91
Organism:Homo sapiens (Human)
Description:ChEMBL_992590
Residue:822
BDBM50155766
NameBDBM50155766
Synonyms:CHEMBL3780374
TypeSmall organic molecule
Emp. Form.C19H20ClN3O3
Mol. Mass.373.833
SMILESCl.N[C@@H]1C[C@H]1c1ccc(NC(=O)c2cccc(c2)N2CCOC2=O)cc1