Reaction Details
TargetAmine oxidase [flavin-containing] A
LigandBDBM50155767
Substrate/Competitorn/a
Meas. Tech.ChEMBL_1564916 (CHEMBL3782873)
IC50 30±n/a nM
Citation Vianello, PBotrugno, OACappa, ADal Zuffo, RDessanti, PMai, AMarrocco, BMattevi, AMeroni, GMinucci, SStazi, GThaler, FTrifiró, PValente, SVilla, MVarasi, MMercurio, C Discovery of a Novel Inhibitor of Histone Lysine-Specific Demethylase 1A (KDM1A/LSD1) as Orally Active Antitumor Agent. J Med Chem59:1501-17 (2016) 
 
Amine oxidase [flavin-containing] A
Name:Amine oxidase [flavin-containing] A
Type:Protein
Mol. Mass.:59689.53
Organism:Homo sapiens (Human)
Description:P21397
Residue:527
BDBM50155767
NameBDBM50155767
Synonyms:CHEMBL3780524
TypeSmall organic molecule
Emp. Form.C19H20ClN3O3
Mol. Mass.373.833
SMILESCl.N[C@@H]1C[C@H]1c1ccc(NC(=O)c2ccc(cc2)N2CCOC2=O)cc1