Reaction Details
TargetSubstance-P receptor
LigandBDBM50070377
Substrate/Competitorn/a
Meas. Tech.ChEMBL_1564949 (CHEMBL3783010)
Ki 6.4±n/a nM
Citation Betti, CStarnowska, JMika, JDyniewicz, JFrankiewicz, LNovoa, ABochynska, MKeresztes, AKosson, PMakuch, WVan Duppen, JChung, NNVanden Broeck, JLipkowski, AWSchiller, PWJanssens, FCeusters, MSommen, FMeert, TPrzewlocka, BTourwé, DBallet, S Dual Alleviation of Acute and Neuropathic Pain by Fused Opioid Agonist-Neurokinin 1 Antagonist Peptidomimetics. ACS Med Chem Lett6:1209-14 (2015) 
 
Substance-P receptor
Name:Substance-P receptor
Type:G Protein-Coupled Receptor (GPCR)
Mol. Mass.:46254.43
Organism:Homo sapiens (Human)
Description:P25103
Residue:407
BDBM50070377
NameBDBM50070377
Synonyms:CHEMBL3408519
TypeSmall organic molecule
Emp. Form.C38H50N8O5
Mol. Mass.698.8542
SMILES[H][C@@]1(Cc2ccccc2CN(CCC(=O)N(C)Cc2ccccc2)C1=O)NC(=O)[C@@H](CCCNC(N)=N)NC(=O)[C@@H](N)Cc1c(C)cc(O)cc1C