Reaction Details
TargetSubstance-P receptor
LigandBDBM50155797
Substrate/Competitorn/a
Meas. Tech.ChEMBL_1564949 (CHEMBL3783010)
Ki 8.3±n/a nM
Citation Betti, CStarnowska, JMika, JDyniewicz, JFrankiewicz, LNovoa, ABochynska, MKeresztes, AKosson, PMakuch, WVan Duppen, JChung, NNVanden Broeck, JLipkowski, AWSchiller, PWJanssens, FCeusters, MSommen, FMeert, TPrzewlocka, BTourwé, DBallet, S Dual Alleviation of Acute and Neuropathic Pain by Fused Opioid Agonist-Neurokinin 1 Antagonist Peptidomimetics. ACS Med Chem Lett6:1209-14 (2015) 
 
Substance-P receptor
Name:Substance-P receptor
Type:G Protein-Coupled Receptor (GPCR)
Mol. Mass.:46254.43
Organism:Homo sapiens (Human)
Description:P25103
Residue:407
BDBM50155797
NameBDBM50155797
Synonyms:CHEMBL3780818
TypeSmall organic molecule
Emp. Form.C55H70F6N10O6
Mol. Mass.1081.1981
SMILESCN(Cc1cc(cc(c1)C(F)(F)F)C(F)(F)F)C(=O)[C@@H]1CCN(C[C@H]1c1ccccc1)C(=O)C[C@H](CCCCN)NC(=O)[C@H](Cc1ccccc1)NC(=O)[C@@H](CCCNC(N)=N)NC(=O)[C@@H](N)Cc1c(C)cc(O)cc1C