Reaction Details
TargetSubstance-P receptor
LigandBDBM50155798
Substrate/Competitorn/a
Meas. Tech.ChEMBL_1564944 (CHEMBL3782901)
Ki 1.4±n/a nM
Citation Betti, CStarnowska, JMika, JDyniewicz, JFrankiewicz, LNovoa, ABochynska, MKeresztes, AKosson, PMakuch, WVan Duppen, JChung, NNVanden Broeck, JLipkowski, AWSchiller, PWJanssens, FCeusters, MSommen, FMeert, TPrzewlocka, BTourwé, DBallet, S Dual Alleviation of Acute and Neuropathic Pain by Fused Opioid Agonist-Neurokinin 1 Antagonist Peptidomimetics. ACS Med Chem Lett6:1209-14 (2015) 
 
Substance-P receptor
Name:Substance-P receptor
Type:G Protein-Coupled Receptor (GPCR)
Mol. Mass.:46254.43
Organism:Homo sapiens (Human)
Description:P25103
Residue:407
BDBM50155798
NameBDBM50155798
Synonyms:CHEMBL3781519
TypeSmall organic molecule
Emp. Form.C54H64F6N10O6
Mol. Mass.1063.1398
SMILESCc1cc(O)cc(C)c1C[C@H](N)C(=O)N[C@H](CCCNC(N)=N)C(=O)N[C@H]1Cc2ccccc2CN(CCC(=O)N2CCN(CC2)[C@@H]2CCN(C[C@@H]2c2ccccc2)C(=O)c2cc(cc(c2)C(F)(F)F)C(F)(F)F)C1=O