Reaction Details
TargetSubstance-P receptor
LigandBDBM50155799
Substrate/Competitorn/a
Meas. Tech.ChEMBL_1564944 (CHEMBL3782901)
Ki 1.4±n/a nM
Citation Betti, CStarnowska, JMika, JDyniewicz, JFrankiewicz, LNovoa, ABochynska, MKeresztes, AKosson, PMakuch, WVan Duppen, JChung, NNVanden Broeck, JLipkowski, AWSchiller, PWJanssens, FCeusters, MSommen, FMeert, TPrzewlocka, BTourwé, DBallet, S Dual Alleviation of Acute and Neuropathic Pain by Fused Opioid Agonist-Neurokinin 1 Antagonist Peptidomimetics. ACS Med Chem Lett6:1209-14 (2015) 
 
Substance-P receptor
Name:Substance-P receptor
Type:G Protein-Coupled Receptor (GPCR)
Mol. Mass.:46254.43
Organism:Homo sapiens (Human)
Description:P25103
Residue:407
BDBM50155799
NameBDBM50155799
Synonyms:CHEMBL3781336
TypeSmall organic molecule
Emp. Form.C51H59F6N9O6
Mol. Mass.1008.0613
SMILESCN([C@@H]1CCN(C[C@@H]1c1ccccc1)C(=O)c1cc(cc(c1)C(F)(F)F)C(F)(F)F)C(=O)CCN1Cc2ccccc2C[C@H](NC(=O)[C@@H](CCCNC(N)=N)NC(=O)[C@@H](N)Cc2c(C)cc(O)cc2C)C1=O