Reaction Details
TargetCannabinoid receptor 2
LigandBDBM50156027
Substrate/Competitorn/a
Meas. Tech.ChEMBL_1565590 (CHEMBL3782259)
Ki 1931±n/a nM
Citation Mugnaini, CBrizzi, ALigresti, AAllarà, MLamponi, SVacondio, FSilva, CMor, MDi Marzo, VCorelli, F Investigations on the 4-Quinolone-3-carboxylic Acid Motif. 7. Synthesis and Pharmacological Evaluation of 4-Quinolone-3-carboxamides and 4-Hydroxy-2-quinolone-3-carboxamides as High Affinity Cannabinoid Receptor 2 (CB2R) Ligands with Improved Aqueous Solubility. J Med Chem59:1052-67 (2016) 
 
Cannabinoid receptor 2
Name:Cannabinoid receptor 2
Type:G Protein-Coupled Receptor (GPCR)
Mol. Mass.:39690.94
Organism:Homo sapiens (Human)
Description:P34972
Residue:360
BDBM50156027
NameBDBM50156027
Synonyms:CHEMBL3781330
TypeSmall organic molecule
Emp. Form.C29H39N3O4S
Mol. Mass.525.703
SMILESCC(C)c1ccc2n(CCN3CCS(=O)(=O)CC3)cc(C(=O)NC34CC5CC(CC(C5)C3)C4)c(=O)c2c1