Reaction Details
TargetCannabinoid receptor 2
LigandBDBM50156093
Substrate/Competitorn/a
Meas. Tech.ChEMBL_1565590 (CHEMBL3782259)
Ki 11±n/a nM
Citation Mugnaini, CBrizzi, ALigresti, AAllarà, MLamponi, SVacondio, FSilva, CMor, MDi Marzo, VCorelli, F Investigations on the 4-Quinolone-3-carboxylic Acid Motif. 7. Synthesis and Pharmacological Evaluation of 4-Quinolone-3-carboxamides and 4-Hydroxy-2-quinolone-3-carboxamides as High Affinity Cannabinoid Receptor 2 (CB2R) Ligands with Improved Aqueous Solubility. J Med Chem59:1052-67 (2016) 
 
Cannabinoid receptor 2
Name:Cannabinoid receptor 2
Type:G Protein-Coupled Receptor (GPCR)
Mol. Mass.:39690.94
Organism:Homo sapiens (Human)
Description:P34972
Residue:360
BDBM50156093
NameBDBM50156093
Synonyms:CHEMBL3781965
TypeSmall organic molecule
Emp. Form.C27H36FN3O2
Mol. Mass.453.592
SMILESCC(C)c1cc2c(cc1F)n(CCN(C)C)cc(C(=O)NC13CC4CC(CC(C4)C1)C3)c2=O