Reaction Details
TargetCannabinoid receptor 2
LigandBDBM50156022
Substrate/Competitorn/a
Meas. Tech.ChEMBL_1565590 (CHEMBL3782259)
IC50 2.0±n/a nM
Citation Mugnaini, CBrizzi, ALigresti, AAllarà, MLamponi, SVacondio, FSilva, CMor, MDi Marzo, VCorelli, F Investigations on the 4-Quinolone-3-carboxylic Acid Motif. 7. Synthesis and Pharmacological Evaluation of 4-Quinolone-3-carboxamides and 4-Hydroxy-2-quinolone-3-carboxamides as High Affinity Cannabinoid Receptor 2 (CB2R) Ligands with Improved Aqueous Solubility. J Med Chem59:1052-67 (2016) 
 
Cannabinoid receptor 2
Name:Cannabinoid receptor 2
Type:G Protein-Coupled Receptor (GPCR)
Mol. Mass.:39690.94
Organism:Homo sapiens (Human)
Description:P34972
Residue:360
BDBM50156022
NameBDBM50156022
Synonyms:CHEMBL3780166
TypeSmall organic molecule
Emp. Form.C25H32N2O3
Mol. Mass.408.5332
SMILESCCCCCn1c2ccccc2c(O)c(C(=O)NC23CC4CC(CC(C4)C2)C3)c1=O