Reaction Details
TargetCannabinoid receptor 2
LigandBDBM50156098
Substrate/Competitorn/a
Meas. Tech.ChEMBL_1565590 (CHEMBL3782259)
Ki 2239±n/a nM
Citation Mugnaini, CBrizzi, ALigresti, AAllarà, MLamponi, SVacondio, FSilva, CMor, MDi Marzo, VCorelli, F Investigations on the 4-Quinolone-3-carboxylic Acid Motif. 7. Synthesis and Pharmacological Evaluation of 4-Quinolone-3-carboxamides and 4-Hydroxy-2-quinolone-3-carboxamides as High Affinity Cannabinoid Receptor 2 (CB2R) Ligands with Improved Aqueous Solubility. J Med Chem59:1052-67 (2016) 
 
Cannabinoid receptor 2
Name:Cannabinoid receptor 2
Type:G Protein-Coupled Receptor (GPCR)
Mol. Mass.:39690.94
Organism:Homo sapiens (Human)
Description:P34972
Residue:360
BDBM50156098
NameBDBM50156098
Synonyms:CHEMBL3781848
TypeSmall organic molecule
Emp. Form.C26H26N2O5S
Mol. Mass.478.56
SMILESCOc1ccc(CNC(=O)c2c(O)c3cc(ccc3n(CCCCO)c2=O)-c2cccs2)cc1