Reaction Details
TargetCannabinoid receptor 2
LigandBDBM50156105
Substrate/Competitorn/a
Meas. Tech.ChEMBL_1563157 (CHEMBL3783895)
Ki 1073±n/a nM
Citation Morales, PWhyte, LSChicharro, RGómez-Cañas, MPazos, MRGoya, PIrving, AJFernández-Ruiz, JRoss, RAJagerovic, N Identification of Novel GPR55 Modulators Using Cell-Impedance-Based Label-Free Technology. J Med Chem59:1840-53 (2016) 
 
Cannabinoid receptor 2
Name:Cannabinoid receptor 2
Type:G Protein-Coupled Receptor (GPCR)
Mol. Mass.:39690.94
Organism:Homo sapiens (Human)
Description:P34972
Residue:360
BDBM50156105
NameBDBM50156105
Synonyms:CHEMBL3781437
TypeSmall organic molecule
Emp. Form.C24H32N4O4
Mol. Mass.440.5353
SMILESCOc1ccc2-c3nn(CCN4CCN(CC4)C(=O)C4CCCO4)cc3C(C)(C)Oc2c1