Reaction Details
TargetCannabinoid receptor 1
LigandBDBM50156106
Substrate/Competitorn/a
Meas. Tech.ChEMBL_1563156 (CHEMBL3783894)
Ki>40000±n/a nM
Citation Morales, PWhyte, LSChicharro, RGómez-Cañas, MPazos, MRGoya, PIrving, AJFernández-Ruiz, JRoss, RAJagerovic, N Identification of Novel GPR55 Modulators Using Cell-Impedance-Based Label-Free Technology. J Med Chem59:1840-53 (2016) 
 
Cannabinoid receptor 1
Name:Cannabinoid receptor 1
Type:G Protein-Coupled Receptor (GPCR)
Mol. Mass.:52868.96
Organism:Homo sapiens (Human)
Description:P21554
Residue:472
BDBM50156106
NameBDBM50156106
Synonyms:CHEMBL3779954
TypeSmall organic molecule
Emp. Form.C27H32N4O4
Mol. Mass.476.5674
SMILESCOc1ccc2-c3nn(CCN4CCN(CC4)C(=O)COc4ccccc4)cc3C(C)(C)Oc2c1