Reaction Details
TargetCannabinoid receptor 1
LigandBDBM50156110
Substrate/Competitorn/a
Meas. Tech.ChEMBL_1563156 (CHEMBL3783894)
Ki>40000±n/a nM
Citation Morales, PWhyte, LSChicharro, RGómez-Cañas, MPazos, MRGoya, PIrving, AJFernández-Ruiz, JRoss, RAJagerovic, N Identification of Novel GPR55 Modulators Using Cell-Impedance-Based Label-Free Technology. J Med Chem59:1840-53 (2016) 
 
Cannabinoid receptor 1
Name:Cannabinoid receptor 1
Type:G Protein-Coupled Receptor (GPCR)
Mol. Mass.:52868.96
Organism:Homo sapiens (Human)
Description:P21554
Residue:472
BDBM50156110
NameBDBM50156110
Synonyms:CHEMBL3780529
TypeSmall organic molecule
Emp. Form.C28H35N5O3
Mol. Mass.489.6092
SMILESCOc1ccc2-c3nn(CNC(=O)CN4CCN(CC4)c4cccc(C)c4C)cc3C(C)(C)Oc2c1