Reaction Details
TargetG-protein coupled receptor 55
LigandBDBM50156104
Substrate/Competitorn/a
Meas. Tech.ChEMBL_1563025 (CHEMBL3783507)
EC50 25±n/a nM
Citation Morales, PWhyte, LSChicharro, RGómez-Cañas, MPazos, MRGoya, PIrving, AJFernández-Ruiz, JRoss, RAJagerovic, N Identification of Novel GPR55 Modulators Using Cell-Impedance-Based Label-Free Technology. J Med Chem59:1840-53 (2016) 
 
G-protein coupled receptor 55
Name:G-protein coupled receptor 55
Type:PROTEIN
Mol. Mass.:36649.72
Organism:Homo sapiens (Human)
Description:ChEMBL_1292265
Residue:319
BDBM50156104
NameBDBM50156104
Synonyms:CHEMBL3780020
TypeSmall organic molecule
Emp. Form.C26H36N4O3
Mol. Mass.452.589
SMILESCOc1ccc2-c3nn(CCN4CCN(CC4)C(=O)C4CCCCC4)cc3C(C)(C)Oc2c1