Reaction Details
TargetG-protein coupled receptor 55
LigandBDBM50156103
Substrate/Competitorn/a
Meas. Tech.ChEMBL_1563021 (CHEMBL3783503)
EC50 0.690000±n/a nM
Citation Morales, PWhyte, LSChicharro, RGómez-Cañas, MPazos, MRGoya, PIrving, AJFernández-Ruiz, JRoss, RAJagerovic, N Identification of Novel GPR55 Modulators Using Cell-Impedance-Based Label-Free Technology. J Med Chem59:1840-53 (2016) 
 
G-protein coupled receptor 55
Name:G-protein coupled receptor 55
Type:PROTEIN
Mol. Mass.:36649.72
Organism:Homo sapiens (Human)
Description:ChEMBL_1292265
Residue:319
BDBM50156103
NameBDBM50156103
Synonyms:CHEMBL3781521
TypeSmall organic molecule
Emp. Form.C24H34N4O3
Mol. Mass.426.5518
SMILESCOc1ccc2-c3nn(CCN4CCN(CC4)C(=O)C(C)(C)C)cc3C(C)(C)Oc2c1