Reaction Details
TargetMitogen-activated protein kinase 14
LigandBDBM14860
Substrate/Competitorn/a
Meas. Tech.ChEMBL_1563504 (CHEMBL3783189)
IC50 12±n/a nM
Citation Onions, STIto, KCharron, CEBrown, RJColucci, MFrickel, FHardy, GJoly, KKing-Underwood, JKizawa, YKnowles, IMurray, PJNovak, ARani, ARapeport, GSmith, AStrong, PTaddei, DMWilliams, JG Discovery of Narrow Spectrum Kinase Inhibitors: New Therapeutic Agents for the Treatment of COPD and Steroid-Resistant Asthma. J Med Chem59:1727-46 (2016) 
 
Mitogen-activated protein kinase 14
Name:Mitogen-activated protein kinase 14
Type:Serine/threonine-protein kinase
Mol. Mass.:41286.76
Organism:Homo sapiens (Human)
Description:Q16539
Residue:360
BDBM14860
NameBDBM14860
Synonyms:1-(5-tert-butyl-2-p-tolyl-2H-pyrazol-3-yl)-3-[4-(2-pyridin-3-yl-ethoxy)-naphthalen-1-yl]-urea BIRB-796 Analog 48
TypeSmall organic molecule
Emp. Form.C32H33N5O2
Mol. Mass.519.6367
SMILESCc1ccc(cc1)-n1nc(cc1NC(=O)Nc1ccc(OCCc2cccnc2)c2ccccc12)C(C)(C)C