Reaction Details
TargetMitogen-activated protein kinase 14
LigandBDBM50156151
Substrate/Competitorn/a
Meas. Tech.ChEMBL_1563504 (CHEMBL3783189)
IC50 24±n/a nM
Citation Onions, STIto, KCharron, CEBrown, RJColucci, MFrickel, FHardy, GJoly, KKing-Underwood, JKizawa, YKnowles, IMurray, PJNovak, ARani, ARapeport, GSmith, AStrong, PTaddei, DMWilliams, JG Discovery of Narrow Spectrum Kinase Inhibitors: New Therapeutic Agents for the Treatment of COPD and Steroid-Resistant Asthma. J Med Chem59:1727-46 (2016) 
 
Mitogen-activated protein kinase 14
Name:Mitogen-activated protein kinase 14
Type:Serine/threonine-protein kinase
Mol. Mass.:41286.76
Organism:Homo sapiens (Human)
Description:Q16539
Residue:360
BDBM50156151
NameBDBM50156151
Synonyms:CHEMBL3780519
TypeSmall organic molecule
Emp. Form.C38H36N6O3
Mol. Mass.624.7308
SMILESCc1ccc(cc1)-n1nc(cc1NC(=O)Nc1ccc(OCc2ccnc(NC(=O)c3ccccc3)c2)c2ccccc12)C(C)(C)C