Reaction Details
TargetMitogen-activated protein kinase 14
LigandBDBM50156169
Substrate/Competitorn/a
Meas. Tech.ChEMBL_1563504 (CHEMBL3783189)
IC50 38±n/a nM
Citation Onions, STIto, KCharron, CEBrown, RJColucci, MFrickel, FHardy, GJoly, KKing-Underwood, JKizawa, YKnowles, IMurray, PJNovak, ARani, ARapeport, GSmith, AStrong, PTaddei, DMWilliams, JG Discovery of Narrow Spectrum Kinase Inhibitors: New Therapeutic Agents for the Treatment of COPD and Steroid-Resistant Asthma. J Med Chem59:1727-46 (2016) 
 
Mitogen-activated protein kinase 14
Name:Mitogen-activated protein kinase 14
Type:Serine/threonine-protein kinase
Mol. Mass.:41286.76
Organism:Homo sapiens (Human)
Description:Q16539
Residue:360
BDBM50156169
NameBDBM50156169
Synonyms:CHEMBL3781999
TypeSmall organic molecule
Emp. Form.C36H40N6O4
Mol. Mass.620.7406
SMILESCOCC(=O)Nc1cc(ccn1)C(C)(C)Oc1ccc(NC(=O)Nc2cc(nn2-c2ccc(C)cc2)C(C)(C)C)c2ccccc12