Reaction Details
Target5-hydroxytryptamine receptor 6
LigandBDBM50156206
Substrate/Competitorn/a
Meas. Tech.ChEMBL_1563720 (CHEMBL3783931)
IC50 1.1±n/a nM
Citation Blass, B Sulfonamide Derivatives and Pharmaceutical Applications Thereof. ACS Med Chem Lett7:12-4 (2016) 
 
5-hydroxytryptamine receptor 6
Name:5-hydroxytryptamine receptor 6
Type:G Protein-Coupled Receptor (GPCR)
Mol. Mass.:46968.43
Organism:Homo sapiens (Human)
Description:P50406
Residue:440
BDBM50156206
NameBDBM50156206
Synonyms:CHEMBL3781263
TypeSmall organic molecule
Emp. Form.C26H33N3O4S
Mol. Mass.483.623
SMILESCOc1ccc2cccc(c2c1)C(C)(C)CNS(=O)(=O)c1ccc(OC)c(c1)N1CCNCC1